{"text_format":"1","workbook":"xlsx","n_sheets":8,"sheets":["Input","печатная_форма","Schedule","Ref","паллетн.этикетки","Order Input","Лист1","Лист2"],"not_rendered":{"charts":0,"images":7,"macros":1,"external_links":0,"defined_names":9,"comments":1,"pivot_tables":0},"unopened":[],"bounds":{"document_bytes":16777216,"sheet_cells":100000,"rows_first":2000,"rows_last":500,"rows_between":2000,"halvings":0,"cell_chars":16384,"cell_head_chars":4096},"cells_cut":0,"cells_raw":0,"read":"whole","date_system":"1900"}

{"sheet":"Input","index":0,"n_rows":681,"n_cols":24,"rows_kept":681,"cut":false,"hidden":false,"merged":[[4,2,4,3],[21,7,21,8],[21,11,21,16],[3,4,4,4],[2,5,2,7],[3,7,3,9],[3,11,3,13],[20,11,20,14]]}
[]
[null,null,null,18]
[null,null,"Customer name","АТЛАСПРИНТ",null,{"$f":"IF(SUM('Order Input'!Y5:Y204)=0,\"\",\"задвоение                                            такой заказ уже есть\")","v":""}]
[null,null,null,null,{"$f":"IF(E11=\"\",\"\",IF(E11<>E9,\"дата отличается от графика\",\"\"))","v":""},null,null,{"$f":"IF(ISERROR(U9),\"ИЗМЕНИТЕ АДРЕС-такого адреса нет\",\"\")","v":""},null,null,null,{"$f":"IF(AND(OR(F9=\"фмхимки\",F9=\"фмсидорово\",F9=\"фмпитер\"),OR(H9=\"Ашан\",H9=\"Метро\",H9=\"Реал\",H9=\"Окей\")),IF(ISERROR(VLOOKUP(X9,Schedule!A:I,8,0)),\"ИЗМЕНИТЕ ДАТУ - Авизация не совпадает с графиком\",\"\"),\"\")","v":"ИЗМЕНИТЕ ДАТУ - Авизация не совпадает с графиком"}]
[null,null,"Название списков -->>",null,null,"Load_Key",null,"Retail","City","Via","hiden",null,null,null,"hidden",null,null,null,null,"hiden","hiden"]
[null,null,"x","x","x","x",null,null,null,null,"x","x",null,"x",null,"x","x",null,null,"x","x","x"]
["Source",null,1,{"$f":"C7+1","v":2},{"$f":"D7+1","v":3},{"$f":"E7+1","v":4},5,6,7,8,9,10,11,12,13,14,15,16,17,{"$f":"D2","v":18},{"$f":"T7+1","v":19},20]
[null,null,"Дата заявки","№ заказа грузополучателя","Дата отправки с ФМ","платформа загрузки","время загрузки","Сеть","Город","Адрес","выбрать адрес грузополучателя","Дата приёмки грузополучателем","Время приёмки Грузополучателем","Вес отправки\n(брутто)","Тип кузова","кол-во паллет","Тип паллет","Service","Комментарий по заявке","Customer name","Unloading point Searchname","Дата привоза на ФМ Ложистик"]
[null,null,null,null,null,"ФМСИДОРОВО",null,"Ашан","Новосибирск","Толмачевский сельсовет,о.п.307 км.",{"$f":"H9&\"'\"&I9&\"'\"&J9","v":"Ашан'Новосибирск'Толмачевский сельсовет,о.п.307 км."},null,null,null,null,null,null,"GR",null,{"$f":"$D$3","v":"АТЛАСПРИНТ"},{"$f":"VLOOKUP(K9,K23:L1012,2,0)","v":"АШАНТОЛМАЧ"},null,{"$f":"H9&\"'\"&I9","v":"Ашан'Новосибирск"},{"$f":"F9&\"'\"&H9&\"'\"&I9&\"'\"&WEEKDAY(L9,2)","v":"ФМСИДОРОВО'Ашан'Новосибирск'6"}]
[]
[null,null,null,"по графику ->",{"$f":"IF(ISERROR(L9-VLOOKUP(X9,Schedule!A:I,8,0)),\"\",L9-VLOOKUP(X9,Schedule!A:I,8,0))","v":""},null,null,"Седьмой Континент",null,"День недели:",null,null,null,null,null,null,null,null,"по графику ->",null,null,{"$f":"IF(ISERROR(L9-VLOOKUP(X9,Schedule!A:I,9,0)),\"\",L9-VLOOKUP(X9,Schedule!A:I,9,0))","v":""}]
[]
[null,null,null,null,null,null,null,null,null,null,null,null,null,null,null,null,"EP => Euro Pallet"]
[null,null,null,null,null,null,null,null,null,null,null,null,null,null,null,null,"UK => UK Pallet"]
[]
[]
[]
[]
[]
[]
{"$rows_left_out":662}
{"sheet":"печатная_форма","index":1,"n_rows":44,"n_cols":11,"rows_kept":44,"cut":false,"hidden":false,"merged":[[8,0,8,10],[41,7,41,8],[5,0,5,3],[5,4,5,10],[6,0,6,3],[6,4,6,10],[7,0,7,3],[7,4,7,10],[4,0,4,3],[4,4,4,10],[0,0,0,10],[1,0,1,10],[2,0,2,10],[3,0,3,3],[3,4,3,10]]}
["Заявка на доставку груза"]
[]
[]
["Заказчик (наименование):"]
["Номер Заказчика в системе Грузополучателя \n(номер поставщика):"]
["Заказчик (ФИО, контактный телефон):"]
["Дата заявки:",null,null,null,{"$f":"Input!C9","v":"00:00:00"}]
["Склад ФМ Ложистик:",null,null,null,"ФМ СИДОРОВО"]
[]
["Номер доставки","Сеть","Город грузополучателя","Адрес грузополучателя","Дата приемки Грузополучателем\n","Время приемки Грузополучателем\n","№ Заказа Грузополучателя","Вес отправки (брутто)","Кол-во паллет","Дата привоза на ФМ Ложистик","Комментарий по заявке"]
[1,{"$f":"IF('Order Input'!L5=0,\"\",VLOOKUP('Order Input'!L5,Input!$L$25:$M$1010,2,FALSE))","v":""},{"$f":"IF(ISERROR(VLOOKUP('Order Input'!H5,Input!$L$25:$Q$1012,4,FALSE)),\"\",VLOOKUP('Order Input'!H5,Input!$L$25:$Q$1012,4,FALSE))","v":""},{"$f":"IF(ISERROR(VLOOKUP('Order Input'!H5,Input!$L$25:$Q$1012,3,FALSE)),\"\",VLOOKUP('Order Input'!H5,Input!$L$25:$Q$1012,3,FALSE))","v":""},{"$f":"IF(B11<>\"\",'Order Input'!I5,\"\")","v":""},{"$f":"IF($B11<>\"\",'Order Input'!J5,\"\")","v":""},{"$f":"IF($B11<>\"\",'Order Input'!O5,\"\")","v":""},{"$f":"IF($B11<>\"\",'Order Input'!P5,\"\")","v":""},{"$f":"IF($B11<>\"\",'Order Input'!R5,\"\")","v":""},{"$f":"IF($B11<>\"\",'Order Input'!V5,\"\")","v":""},{"$f":"IF($B11<>\"\",'Order Input'!S5,\"\")","v":""}]
[2,{"$f":"IF('Order Input'!L6=0,\"\",VLOOKUP('Order Input'!L6,Input!$L$25:$M$1010,2,FALSE))","v":""},{"$f":"IF(ISERROR(VLOOKUP('Order Input'!H6,Input!$L$25:$Q$1012,4,FALSE)),\"\",VLOOKUP('Order Input'!H6,Input!$L$25:$Q$1012,4,FALSE))","v":""},{"$f":"IF(ISERROR(VLOOKUP('Order Input'!H6,Input!$L$25:$Q$1012,3,FALSE)),\"\",VLOOKUP('Order Input'!H6,Input!$L$25:$Q$1012,3,FALSE))","v":""},{"$f":"IF(B12<>\"\",'Order Input'!I6,\"\")","v":""},{"$f":"IF($B12<>\"\",'Order Input'!J6,\"\")","v":""},{"$f":"IF($B12<>\"\",'Order Input'!O6,\"\")","v":""},{"$f":"IF($B12<>\"\",'Order Input'!P6,\"\")","v":""},{"$f":"IF($B12<>\"\",'Order Input'!R6,\"\")","v":""},{"$f":"IF($B12<>\"\",'Order Input'!V6,\"\")","v":""},{"$f":"IF($B12<>\"\",'Order Input'!S6,\"\")","v":""}]
[3,{"$f":"IF('Order Input'!L7=0,\"\",VLOOKUP('Order Input'!L7,Input!$L$25:$M$1010,2,FALSE))","v":""},{"$f":"IF(ISERROR(VLOOKUP('Order Input'!H7,Input!$L$25:$Q$1012,4,FALSE)),\"\",VLOOKUP('Order Input'!H7,Input!$L$25:$Q$1012,4,FALSE))","v":""},{"$f":"IF(ISERROR(VLOOKUP('Order Input'!H7,Input!$L$25:$Q$1012,3,FALSE)),\"\",VLOOKUP('Order Input'!H7,Input!$L$25:$Q$1012,3,FALSE))","v":""},{"$f":"IF(B13<>\"\",'Order Input'!I7,\"\")","v":""},{"$f":"IF($B13<>\"\",'Order Input'!J7,\"\")","v":""},{"$f":"IF($B13<>\"\",'Order Input'!O7,\"\")","v":""},{"$f":"IF($B13<>\"\",'Order Input'!P7,\"\")","v":""},{"$f":"IF($B13<>\"\",'Order Input'!R7,\"\")","v":""},{"$f":"IF($B13<>\"\",'Order Input'!V7,\"\")","v":""},{"$f":"IF($B13<>\"\",'Order Input'!S7,\"\")","v":""}]
[4,{"$f":"IF('Order Input'!L8=0,\"\",VLOOKUP('Order Input'!L8,Input!$L$25:$M$1010,2,FALSE))","v":""},{"$f":"IF(ISERROR(VLOOKUP('Order Input'!H8,Input!$L$25:$Q$1012,4,FALSE)),\"\",VLOOKUP('Order Input'!H8,Input!$L$25:$Q$1012,4,FALSE))","v":""},{"$f":"IF(ISERROR(VLOOKUP('Order Input'!H8,Input!$L$25:$Q$1012,3,FALSE)),\"\",VLOOKUP('Order Input'!H8,Input!$L$25:$Q$1012,3,FALSE))","v":""},{"$f":"IF(B14<>\"\",'Order Input'!I8,\"\")","v":""},{"$f":"IF($B14<>\"\",'Order Input'!J8,\"\")","v":""},{"$f":"IF($B14<>\"\",'Order Input'!O8,\"\")","v":""},{"$f":"IF($B14<>\"\",'Order Input'!P8,\"\")","v":""},{"$f":"IF($B14<>\"\",'Order Input'!R8,\"\")","v":""},{"$f":"IF($B14<>\"\",'Order Input'!V8,\"\")","v":""},{"$f":"IF($B14<>\"\",'Order Input'!S8,\"\")","v":""}]
[5,{"$f":"IF('Order Input'!L9=0,\"\",VLOOKUP('Order Input'!L9,Input!$L$25:$M$1010,2,FALSE))","v":""},{"$f":"IF(ISERROR(VLOOKUP('Order Input'!H9,Input!$L$25:$Q$1012,4,FALSE)),\"\",VLOOKUP('Order Input'!H9,Input!$L$25:$Q$1012,4,FALSE))","v":""},{"$f":"IF(ISERROR(VLOOKUP('Order Input'!H9,Input!$L$25:$Q$1012,3,FALSE)),\"\",VLOOKUP('Order Input'!H9,Input!$L$25:$Q$1012,3,FALSE))","v":""},{"$f":"IF(B15<>\"\",'Order Input'!I9,\"\")","v":""},{"$f":"IF($B15<>\"\",'Order Input'!J9,\"\")","v":""},{"$f":"IF($B15<>\"\",'Order Input'!O9,\"\")","v":""},{"$f":"IF($B15<>\"\",'Order Input'!P9,\"\")","v":""},{"$f":"IF($B15<>\"\",'Order Input'!R9,\"\")","v":""},{"$f":"IF($B15<>\"\",'Order Input'!V9,\"\")","v":""},{"$f":"IF($B15<>\"\",'Order Input'!S9,\"\")","v":""}]
[6,{"$f":"IF('Order Input'!L10=0,\"\",VLOOKUP('Order Input'!L10,Input!$L$25:$M$1010,2,FALSE))","v":""},{"$f":"IF(ISERROR(VLOOKUP('Order Input'!H10,Input!$L$25:$Q$1012,4,FALSE)),\"\",VLOOKUP('Order Input'!H10,Input!$L$25:$Q$1012,4,FALSE))","v":""},{"$f":"IF(ISERROR(VLOOKUP('Order Input'!H10,Input!$L$25:$Q$1012,3,FALSE)),\"\",VLOOKUP('Order Input'!H10,Input!$L$25:$Q$1012,3,FALSE))","v":""},{"$f":"IF(B16<>\"\",'Order Input'!I10,\"\")","v":""},{"$f":"IF($B16<>\"\",'Order Input'!J10,\"\")","v":""},{"$f":"IF($B16<>\"\",'Order Input'!O10,\"\")","v":""},{"$f":"IF($B16<>\"\",'Order Input'!P10,\"\")","v":""},{"$f":"IF($B16<>\"\",'Order Input'!R10,\"\")","v":""},{"$f":"IF($B16<>\"\",'Order Input'!V10,\"\")","v":""},{"$f":"IF($B16<>\"\",'Order Input'!S10,\"\")","v":""}]
[7,{"$f":"IF('Order Input'!L11=0,\"\",VLOOKUP('Order Input'!L11,Input!$L$25:$M$1010,2,FALSE))","v":""},{"$f":"IF(ISERROR(VLOOKUP('Order Input'!H11,Input!$L$25:$Q$1012,4,FALSE)),\"\",VLOOKUP('Order Input'!H11,Input!$L$25:$Q$1012,4,FALSE))","v":""},{"$f":"IF(ISERROR(VLOOKUP('Order Input'!H11,Input!$L$25:$Q$1012,3,FALSE)),\"\",VLOOKUP('Order Input'!H11,Input!$L$25:$Q$1012,3,FALSE))","v":""},{"$f":"IF(B17<>\"\",'Order Input'!I11,\"\")","v":""},{"$f":"IF($B17<>\"\",'Order Input'!J11,\"\")","v":""},{"$f":"IF($B17<>\"\",'Order Input'!O11,\"\")","v":""},{"$f":"IF($B17<>\"\",'Order Input'!P11,\"\")","v":""},{"$f":"IF($B17<>\"\",'Order Input'!R11,\"\")","v":""},{"$f":"IF($B17<>\"\",'Order Input'!V11,\"\")","v":""},{"$f":"IF($B17<>\"\",'Order Input'!S11,\"\")","v":""}]
[8,{"$f":"IF('Order Input'!L12=0,\"\",VLOOKUP('Order Input'!L12,Input!$L$25:$M$1010,2,FALSE))","v":""},{"$f":"IF(ISERROR(VLOOKUP('Order Input'!H12,Input!$L$25:$Q$1012,4,FALSE)),\"\",VLOOKUP('Order Input'!H12,Input!$L$25:$Q$1012,4,FALSE))","v":""},{"$f":"IF(ISERROR(VLOOKUP('Order Input'!H12,Input!$L$25:$Q$1012,3,FALSE)),\"\",VLOOKUP('Order Input'!H12,Input!$L$25:$Q$1012,3,FALSE))","v":""},{"$f":"IF(B18<>\"\",'Order Input'!I12,\"\")","v":""},{"$f":"IF($B18<>\"\",'Order Input'!J12,\"\")","v":""},{"$f":"IF($B18<>\"\",'Order Input'!O12,\"\")","v":""},{"$f":"IF($B18<>\"\",'Order Input'!P12,\"\")","v":""},{"$f":"IF($B18<>\"\",'Order Input'!R12,\"\")","v":""},{"$f":"IF($B18<>\"\",'Order Input'!V12,\"\")","v":""},{"$f":"IF($B18<>\"\",'Order Input'!S12,\"\")","v":""}]
[9,{"$f":"IF('Order Input'!L13=0,\"\",VLOOKUP('Order Input'!L13,Input!$L$25:$M$1010,2,FALSE))","v":""},{"$f":"IF(ISERROR(VLOOKUP('Order Input'!H13,Input!$L$25:$Q$1012,4,FALSE)),\"\",VLOOKUP('Order Input'!H13,Input!$L$25:$Q$1012,4,FALSE))","v":""},{"$f":"IF(ISERROR(VLOOKUP('Order Input'!H13,Input!$L$25:$Q$1012,3,FALSE)),\"\",VLOOKUP('Order Input'!H13,Input!$L$25:$Q$1012,3,FALSE))","v":""},{"$f":"IF(B19<>\"\",'Order Input'!I13,\"\")","v":""},{"$f":"IF($B19<>\"\",'Order Input'!J13,\"\")","v":""},{"$f":"IF($B19<>\"\",'Order Input'!O13,\"\")","v":""},{"$f":"IF($B19<>\"\",'Order Input'!P13,\"\")","v":""},{"$f":"IF($B19<>\"\",'Order Input'!R13,\"\")","v":""},{"$f":"IF($B19<>\"\",'Order Input'!V13,\"\")","v":""},{"$f":"IF($B19<>\"\",'Order Input'!S13,\"\")","v":""}]
[10,{"$f":"IF('Order Input'!L14=0,\"\",VLOOKUP('Order Input'!L14,Input!$L$25:$M$1010,2,FALSE))","v":""},{"$f":"IF(ISERROR(VLOOKUP('Order Input'!H14,Input!$L$25:$Q$1012,4,FALSE)),\"\",VLOOKUP('Order Input'!H14,Input!$L$25:$Q$1012,4,FALSE))","v":""},{"$f":"IF(ISERROR(VLOOKUP('Order Input'!H14,Input!$L$25:$Q$1012,3,FALSE)),\"\",VLOOKUP('Order Input'!H14,Input!$L$25:$Q$1012,3,FALSE))","v":""},{"$f":"IF(B20<>\"\",'Order Input'!I14,\"\")","v":""},{"$f":"IF($B20<>\"\",'Order Input'!J14,\"\")","v":""},{"$f":"IF($B20<>\"\",'Order Input'!O14,\"\")","v":""},{"$f":"IF($B20<>\"\",'Order Input'!P14,\"\")","v":""},{"$f":"IF($B20<>\"\",'Order Input'!R14,\"\")","v":""},{"$f":"IF($B20<>\"\",'Order Input'!V14,\"\")","v":""},{"$f":"IF($B20<>\"\",'Order Input'!S14,\"\")","v":""}]
{"$rows_left_out":25}
{"sheet":"Schedule","index":2,"n_rows":327,"n_cols":13,"rows_kept":327,"cut":false,"hidden":true,"merged":[]}
["ключ","From\nregion","To\nregion","гор","No of days to this region","кл","Unloading\nday of week","Loading\ndays before","Delivery to FM days befor"]
[{"$f":"B2&\"'\"&C2&\"'\"&D2&\"'\"&G2","v":"'''День недели\nАВИЗАЦИЯ"},null,null,null,null,null,"День недели\nАВИЗАЦИЯ","к-во дней \nв пути   \nдо авизации","дней от привоза до авизации"]
[{"$f":"B3&\"'\"&C3&\"'\"&D3&\"'\"&G3","v":"ФМХИМКИ'Атак'Москва'"},"ФМХИМКИ","Атак","Москва",null,"ФМХИМКИ'Атак'Москва","","",""]
["ФМХИМКИ'Атак'Московская обл.'","ФМХИМКИ","Атак","Московская обл.",null,"ФМХИМКИ'Атак'Московская обл.","","",""]
["ФМХИМКИ'Атак'Владимир'","ФМХИМКИ","Атак","Владимир",null,"ФМХИМКИ'Атак'Владимир","","",""]
["ФМХИМКИ'Атак'Чехов'","ФМХИМКИ","Атак","Чехов",null,"ФМХИМКИ'Атак'Чехов","","",""]
["ФМХИМКИ'Атак'Рязань'","ФМХИМКИ","Атак","Рязань",null,"ФМХИМКИ'Атак'Рязань","","",""]
["ФМХИМКИ'Атак'Тверь'","ФМХИМКИ","Атак","Тверь",null,"ФМХИМКИ'Атак'Тверь","","",""]
["ФМХИМКИ'Ашан'Москва'","ФМХИМКИ","Ашан","Москва",null,"ФМХИМКИ'Ашан'Москва","","",""]
["ФМХИМКИ'АШАН'Московская обл.'","ФМХИМКИ","АШАН","Московская обл.",null,"ФМХИМКИ'АШАН'Московская обл.","","",""]
["ФМХИМКИ'Ашан'Санкт-Петербург'3","ФМХИМКИ","Ашан","Санкт-Петербург",null,"ФМХИМКИ'Ашан'Санкт-Петербург",3,1,2]
["ФМХИМКИ'Ашан'Ленинградская обл.'","ФМХИМКИ","Ашан","Ленинградская обл.",null,"ФМХИМКИ'Ашан'Ленинградская обл.","","",""]
["ФМХИМКИ'Ашан'Екатеринбург'","ФМХИМКИ","Ашан","Екатеринбург",null,"ФМХИМКИ'Ашан'Екатеринбург","","",""]
["ФМХИМКИ'Ашан'Верхняя Пышма'7","ФМХИМКИ","Ашан","Верхняя Пышма",null,"ФМХИМКИ'Ашан'Верхняя Пышма",7,4,5]
["ФМХИМКИ'Ашан'Верхняя Пышма'1","ФМХИМКИ","Ашан","Верхняя Пышма",null,"ФМХИМКИ'Ашан'Верхняя Пышма",1,4,5]
["ФМХИМКИ'Ашан'Ростовская обл.'4","ФМХИМКИ","Ашан","Ростовская обл.",null,"ФМХИМКИ'Ашан'Ростовская обл.",4,2,3]
["ФМХИМКИ'Ашан'Ростовская обл.'6","ФМХИМКИ","Ашан","Ростовская обл.",null,"ФМХИМКИ'Ашан'Ростовская обл.",6,2,3]
["ФМХИМКИ'Ашан'Новосибирск'5","ФМХИМКИ","Ашан","Новосибирск",null,"ФМХИМКИ'Ашан'Новосибирск",5,7,8]
["ФМХИМКИ'Ашан'Нижний Новгород'","ФМХИМКИ","Ашан","Нижний Новгород",null,"ФМХИМКИ'Ашан'Нижний Новгород","","",""]
["ФМХИМКИ'Ашан'Омск'","ФМХИМКИ","Ашан","Омск",null,"ФМХИМКИ'Ашан'Омск","","",""]
{"$rows_left_out":308}
{"sheet":"Ref","index":3,"n_rows":18,"n_cols":4,"rows_kept":18,"cut":false,"hidden":true,"merged":[]}
["Обновление списка адресов"]
[1,"в отдельном файле - выгрузить адреса и составить список сетей/прочих адресов"]
[null,"вставить  в  J:J и обновить границы диапазона Retail"]
[]
[2,"собрать сисписок Ритейлеров и их городов. ОТСОРТИРОВАТЬ ПО Ритейлеру"]
[null,"заменить Пушкино и т.п. на Московскую обл. + убрать \"г.\" через таблицу подстановки"]
["city","добавить номер в списке сортировки и отсортировать по нему после Ритейлера"]
[null,"вставить в N:M и обновить границы диапазона City"]
[]
[]
[]
[]
[]
[]
[]
[]
[]
[null,"unloadsearch",null,"для расшифровки назв+ адреса сети и её вывода на лист \"Печатная форма\"(заявка)"]

{"sheet":"паллетн.этикетки","index":4,"n_rows":20,"n_cols":1,"rows_kept":20,"cut":false,"hidden":false,"merged":[]}
["                      Паллетная этикетка"]
["Наименование \nЗаказчика:"]
["Номер накладной:"]
["Номер Заказчика в системе Грузополучателя \n(номер поставщика):"]
[]
["Номер заказа Грузополучателя:"]
[]
["Порядковый номер паллеты с указанным номером заказа:"]
[]
["Общее кол-во паллет с указанным номером заказа:"]
[]
["Дата приемки продукции\nГрузополучателем:"]
[]
["Время приемки продукции\nГрузополучателем:"]
[]
["Наименование \nГрузополучателя:"]
[]
["Город Грузополучателя:"]
[]
["Адрес грузополучателя:"]
{"$rows_left_out":1}
{"sheet":"Order Input","index":5,"n_rows":286,"n_cols":31,"rows_kept":286,"cut":false,"hidden":false,"merged":[]}
[null,null,{"$f":"C4","v":"Заказчик"},{"$f":"D4","v":"место загрузки"},"дата заказа","дата отправки","время отправки","адрес доставки","дата приёмки грузополучателем","время приёмки грузополучателем","Unloading name","Unloading search name","Unloading city","Unloading address","№ заказа","Вес (брутто), кг","Тип кузова","Кол-во","Комментарии","Тип паллет","Сервис","дата привоза на ФМ Ложистик"]
["Source",null,18,4,1,3,5,19,10,11,null,19,null,null,2,12,13,14,17,15,16,20]
[null,null,null,null,null,null,null,null,null,null,"Hidden","Hidden","Hidden","Hidden"]
["номер заказа","расписание","Заказчик","место загрузки","дата заказа","дата отправки","время отправки","адрес доставки","дата приёмки грузополучателем","время приёмки грузополучателем","Unloading name","Unloading search name","Unloading city","Unloading address","№ заказа","Вес (брутто), кг","Тип кузова","Кол-во","Комментарии","Тип паллет","Сервис","дата привоза на ФМ Ложистик"]
[{"$f":"IF(LEN(O5)>70,\"з\",\"\")","v":""},{"$f":"IF(OR(D5=\"фмхимки\",D5=\"фмсидорово\"),IF((I5-F5)=AE5,\"\",\"x\"),\"\")","v":""},null,null,null,null,null,null,null,null,null,null,null,null,null,null,null,null,null,null,null,null,null,{"$f":"C5&D5&E5&F5&G5&H5&I5&J5&O5&P5&Q5&R5&S5&T5&U5&V5","v":""},{"$f":"IF(X5=\"\",\"\",IF(COUNTIF($X$5:$X5,$X5)>1,1,\"\"))","v":""},null,{"$f":"IF(H5=\"\",\"\",VLOOKUP(H5,unloadSearch,2,0))","v":""},{"$f":"IF(H5=\"\",\"\",VLOOKUP(H5,unloadSearch,4,0))","v":""},{"$f":"IF(H5=\"\",\"\",VLOOKUP(H5,unloadSearch,3,0))","v":""},{"$f":"D5&\"'\"&AA5&\"'\"&AB5&\"'\"&WEEKDAY(I5,2)","v":"'''6"},{"$f":"IF(ISERROR(VLOOKUP(AD5,Schedule!A:H,8,0)),0,(VLOOKUP(AD5,Schedule!A:H,8,0)))","v":0}]
[{"$f":"IF(LEN(O6)>70,\"з\",\"\")","v":""},{"$f":"IF(OR(D6=\"фмхимки\",D6=\"фмсидорово\"),IF((I6-F6)=AE6,\"\",\"x\"),\"\")","v":""},null,null,null,null,null,null,null,null,null,null,null,null,null,null,null,null,null,null,null,null,null,{"$f":"C6&D6&E6&F6&G6&H6&I6&J6&O6&P6&Q6&R6&S6&T6&U6&V6","v":""},{"$f":"IF(X6=\"\",\"\",IF(COUNTIF($X$5:$X6,$X6)>1,1,\"\"))","v":""},null,"","","",{"$f":"D6&\"'\"&AA6&\"'\"&AB6&\"'\"&WEEKDAY(I6,2)","v":"'''6"},{"$f":"IF(ISERROR(VLOOKUP(AD6,Schedule!A:H,8,0)),0,(VLOOKUP(AD6,Schedule!A:H,8,0)))","v":0}]
["","",null,null,null,null,null,null,null,null,null,null,null,null,null,null,null,null,null,null,null,null,null,"",{"$f":"IF(X7=\"\",\"\",IF(COUNTIF($X$5:$X7,$X7)>1,1,\"\"))","v":""},null,"","","","'''6",{"$f":"IF(ISERROR(VLOOKUP(AD7,Schedule!A:H,8,0)),0,(VLOOKUP(AD7,Schedule!A:H,8,0)))","v":0}]
["","",null,null,null,null,null,null,null,null,null,null,null,null,null,null,null,null,null,null,null,null,null,"",{"$f":"IF(X8=\"\",\"\",IF(COUNTIF($X$5:$X8,$X8)>1,1,\"\"))","v":""},null,"","","","'''6",{"$f":"IF(ISERROR(VLOOKUP(AD8,Schedule!A:H,8,0)),0,(VLOOKUP(AD8,Schedule!A:H,8,0)))","v":0}]
["","",null,null,null,null,null,null,null,null,null,null,null,null,null,null,null,null,null,null,null,null,null,"",{"$f":"IF(X9=\"\",\"\",IF(COUNTIF($X$5:$X9,$X9)>1,1,\"\"))","v":""},null,"","","","'''6",{"$f":"IF(ISERROR(VLOOKUP(AD9,Schedule!A:H,8,0)),0,(VLOOKUP(AD9,Schedule!A:H,8,0)))","v":0}]
["","",null,null,null,null,null,null,null,null,null,null,null,null,null,null,null,null,null,null,null,null,null,"",{"$f":"IF(X10=\"\",\"\",IF(COUNTIF($X$5:$X10,$X10)>1,1,\"\"))","v":""},null,"","","","'''6",{"$f":"IF(ISERROR(VLOOKUP(AD10,Schedule!A:H,8,0)),0,(VLOOKUP(AD10,Schedule!A:H,8,0)))","v":0}]
["","",null,null,null,null,null,null,null,null,null,null,null,null,null,null,null,null,null,null,null,null,null,"",{"$f":"IF(X11=\"\",\"\",IF(COUNTIF($X$5:$X11,$X11)>1,1,\"\"))","v":""},null,"","","","'''6",{"$f":"IF(ISERROR(VLOOKUP(AD11,Schedule!A:H,8,0)),0,(VLOOKUP(AD11,Schedule!A:H,8,0)))","v":0}]
["","",null,null,null,null,null,null,null,null,null,null,null,null,null,null,null,null,null,null,null,null,null,"",{"$f":"IF(X12=\"\",\"\",IF(COUNTIF($X$5:$X12,$X12)>1,1,\"\"))","v":""},null,"","","","'''6",{"$f":"IF(ISERROR(VLOOKUP(AD12,Schedule!A:H,8,0)),0,(VLOOKUP(AD12,Schedule!A:H,8,0)))","v":0}]
["","",null,null,null,null,null,null,null,null,null,null,null,null,null,null,null,null,null,null,null,null,null,"",{"$f":"IF(X13=\"\",\"\",IF(COUNTIF($X$5:$X13,$X13)>1,1,\"\"))","v":""},null,"","","","'''6",{"$f":"IF(ISERROR(VLOOKUP(AD13,Schedule!A:H,8,0)),0,(VLOOKUP(AD13,Schedule!A:H,8,0)))","v":0}]
["","",null,null,null,null,null,null,null,null,null,null,null,null,null,null,null,null,null,null,null,null,null,"",{"$f":"IF(X14=\"\",\"\",IF(COUNTIF($X$5:$X14,$X14)>1,1,\"\"))","v":""},null,"","","","'''6",{"$f":"IF(ISERROR(VLOOKUP(AD14,Schedule!A:H,8,0)),0,(VLOOKUP(AD14,Schedule!A:H,8,0)))","v":0}]
["","",null,null,null,null,null,null,null,null,null,null,null,null,null,null,null,null,null,null,null,null,null,"",{"$f":"IF(X15=\"\",\"\",IF(COUNTIF($X$5:$X15,$X15)>1,1,\"\"))","v":""},null,"","","","'''6",{"$f":"IF(ISERROR(VLOOKUP(AD15,Schedule!A:H,8,0)),0,(VLOOKUP(AD15,Schedule!A:H,8,0)))","v":0}]
["","",null,null,null,null,null,null,null,null,null,null,null,null,null,null,null,null,null,null,null,null,null,"",{"$f":"IF(X16=\"\",\"\",IF(COUNTIF($X$5:$X16,$X16)>1,1,\"\"))","v":""},null,"","","","'''6",{"$f":"IF(ISERROR(VLOOKUP(AD16,Schedule!A:H,8,0)),0,(VLOOKUP(AD16,Schedule!A:H,8,0)))","v":0}]
["","",null,null,null,null,null,null,null,null,null,null,null,null,null,null,null,null,null,null,null,null,null,"",{"$f":"IF(X17=\"\",\"\",IF(COUNTIF($X$5:$X17,$X17)>1,1,\"\"))","v":""},null,"","","","'''6",{"$f":"IF(ISERROR(VLOOKUP(AD17,Schedule!A:H,8,0)),0,(VLOOKUP(AD17,Schedule!A:H,8,0)))","v":0}]
["","",null,null,null,null,null,null,null,null,null,null,null,null,null,null,null,null,null,null,null,null,null,"",{"$f":"IF(X18=\"\",\"\",IF(COUNTIF($X$5:$X18,$X18)>1,1,\"\"))","v":""},null,"","","","'''6",{"$f":"IF(ISERROR(VLOOKUP(AD18,Schedule!A:H,8,0)),0,(VLOOKUP(AD18,Schedule!A:H,8,0)))","v":0}]
["","",null,null,null,null,null,null,null,null,null,null,null,null,null,null,null,null,null,null,null,null,null,"",{"$f":"IF(X19=\"\",\"\",IF(COUNTIF($X$5:$X19,$X19)>1,1,\"\"))","v":""},null,"","","","'''6",{"$f":"IF(ISERROR(VLOOKUP(AD19,Schedule!A:H,8,0)),0,(VLOOKUP(AD19,Schedule!A:H,8,0)))","v":0}]
["","",null,null,null,null,null,null,null,null,null,null,null,null,null,null,null,null,null,null,null,null,null,"",{"$f":"IF(X20=\"\",\"\",IF(COUNTIF($X$5:$X20,$X20)>1,1,\"\"))","v":""},null,"","","","'''6",{"$f":"IF(ISERROR(VLOOKUP(AD20,Schedule!A:H,8,0)),0,(VLOOKUP(AD20,Schedule!A:H,8,0)))","v":0}]
{"$rows_left_out":267}
{"sheet":"Лист1","index":6,"n_rows":0,"n_cols":0,"rows_kept":0,"cut":false,"hidden":true,"merged":[]}

{"sheet":"Лист2","index":7,"n_rows":0,"n_cols":0,"rows_kept":0,"cut":false,"hidden":true,"merged":[]}